1

Closed

Build failed

description

Tried to build the downloaded package without success. There are several compiler errors. Please make sure that the Visual Studio Solution from the download package can be built without further actions.

Here is the output:
1>------ Rebuild All started: Project: Pocos, Configuration: Debug Any CPU ------
2>------ Rebuild All started: Project: WpfConverters, Configuration: Debug Any CPU ------
1> Pocos -> C:\Users\Clemens\Projekte\PrismPhotoBrowser\Pocos\bin\Debug\Pocos.dll
2> WpfConverters -> C:\Users\Clemens\Projekte\PrismPhotoBrowser\WpfConverters\bin\Debug\WpfConverters.dll
3>------ Rebuild All started: Project: ApplicationState, Configuration: Debug Any CPU ------
4>------ Rebuild All started: Project: TyburnExpButtons, Configuration: Debug Any CPU ------
3> ApplicationState -> C:\Users\Clemens\Projekte\PrismPhotoBrowser\ApplicationState\bin\Debug\ApplicationState.dll
5>------ Rebuild All started: Project: GlobalEvents, Configuration: Debug Any CPU ------
5> GlobalEvents -> C:\Users\Clemens\Projekte\PrismPhotoBrowser\GlobalEvents\bin\Debug\GlobalEvents.dll
6>------ Rebuild All started: Project: Infrastructure, Configuration: Debug Any CPU ------
4> TyburnExpButtons -> C:\Users\Clemens\Projekte\PrismPhotoBrowser\TyburnExpButtons\bin\Debug\TyburnExpButtons.dll
6>C:\Windows\Microsoft.NET\Framework\v4.0.30319\Microsoft.Common.targets(1605,5): warning MSB3245: Could not resolve this reference. Could not locate the assembly "Microsoft.Practices.ServiceLocation". Check to make sure the assembly exists on disk. If this reference is required by your code, you may get compilation errors.
6>C:\Users\Clemens\Projekte\PrismPhotoBrowser\Infrastructure\Behaviors\DialogActivationBehavior.cs(28,27,28,42): error CS0234: The type or namespace name 'ServiceLocation' does not exist in the namespace 'Microsoft.Practices' (are you missing an assembly reference?)
6>C:\Users\Clemens\Projekte\PrismPhotoBrowser\Infrastructure\Behaviors\RegionPopupBehaviors.cs(20,27,20,42): error CS0234: The type or namespace name 'ServiceLocation' does not exist in the namespace 'Microsoft.Practices' (are you missing an assembly reference?)
7>------ Rebuild All started: Project: ColorInfoDataProvider, Configuration: Debug Any CPU ------
7> ColorInfoDataProvider -> C:\Users\Clemens\Projekte\PrismPhotoBrowser\ColorInfoDataProvider\bin\Debug\ColorInfoDataProvider.dll
8>------ Rebuild All started: Project: CustomHelpers, Configuration: Debug Any CPU ------
8>CSC : error CS0006: Metadata file 'C:\Users\Clemens\Projekte\PrismPhotoBrowser\Infrastructure\bin\Debug\Infrastructure.dll' could not be found
9>------ Rebuild All started: Project: SortInfoDataProvider, Configuration: Debug Any CPU ------
10>------ Rebuild All started: Project: TyburnUserControls, Configuration: Debug Any CPU ------
9> SortInfoDataProvider -> C:\Users\Clemens\Projekte\PrismPhotoBrowser\SortInfoDataProvider\bin\Debug\SortInfoDataProvider.dll
11>------ Rebuild All started: Project: ImageFileExtensionsDataProvider, Configuration: Debug Any CPU ------
10>CSC : error CS0006: Metadata file 'C:\Users\Clemens\Projekte\PrismPhotoBrowser\CustomHelpers\bin\Debug\CustomHelpers.dll' could not be found
12>------ Rebuild All started: Project: TyburnDirectoryBrowser, Configuration: Debug Any CPU ------
11> ImageFileExtensionsDataProvider -> C:\Users\Clemens\Projekte\PrismPhotoBrowser\ImageFileExtensionsDataProvider\bin\Debug\ImageFileExtensionsDataProvider.dll
13>------ Rebuild All started: Project: ImageFileServices, Configuration: Debug Any CPU ------
13> ImageFileServices -> C:\Users\Clemens\Projekte\PrismPhotoBrowser\ImageFileServices\bin\Debug\ImageFileServices.dll
14>------ Rebuild All started: Project: DirectoryServices, Configuration: Debug Any CPU ------
14>CSC : error CS0006: Metadata file 'C:\Users\Clemens\Projekte\PrismPhotoBrowser\Infrastructure\bin\Debug\Infrastructure.dll' could not be found
12> TyburnDirectoryBrowser -> C:\Users\Clemens\Projekte\PrismPhotoBrowser\TyburnDirectoryBrowser\bin\Debug\TyburnDirectoryBrowser.dll
15>------ Rebuild All started: Project: ImageFileServicesUnitTests, Configuration: Debug Any CPU ------
16>------ Rebuild All started: Project: PopupViewsModule, Configuration: Debug Any CPU ------
15> ImageFileServicesUnitTests -> C:\Users\Clemens\Projekte\PrismPhotoBrowser\ImageFileServicesUnitTests\bin\Debug\ImageFileServicesUnitTests.dll
17>------ Rebuild All started: Project: CommandLineUnitTests, Configuration: Debug Any CPU ------
16>C:\Users\Clemens\Projekte\PrismPhotoBrowser\PopupViewsModule\Views\PopupGetTextView.xaml(11,22): error MC3074: The tag 'DingTip' does not exist in XML namespace 'clr-namespace:TyburnUserControls;assembly=TyburnUserControls'. Line 11 Position 22.
16>C:\Users\Clemens\Projekte\PrismPhotoBrowser\PopupViewsModule\Views\PopupHelpAboutView.xaml(33,26): error MC3074: The tag 'DingTip' does not exist in XML namespace 'clr-namespace:TyburnUserControls;assembly=TyburnUserControls'. Line 33 Position 26.
16>C:\Users\Clemens\Projekte\PrismPhotoBrowser\PopupViewsModule\Views\PopupMessageBoxView.xaml(34,26): error MC3074: The tag 'DingTip' does not exist in XML namespace 'clr-namespace:TyburnUserControls;assembly=TyburnUserControls'. Line 34 Position 26.
16>C:\Users\Clemens\Projekte\PrismPhotoBrowser\PopupViewsModule\Views\PopupProgramOptionsView.xaml(35,26): error MC3074: The tag 'DingTip' does not exist in XML namespace 'clr-namespace:TyburnUserControls;assembly=TyburnUserControls'. Line 35 Position 26.
18>------ Rebuild All started: Project: MainViewsModule, Configuration: Debug Any CPU ------
18>C:\Windows\Microsoft.NET\Framework\v4.0.30319\Microsoft.Common.targets(1605,5): warning MSB3245: Could not resolve this reference. Could not locate the assembly "Microsoft.Practices.ServiceLocation". Check to make sure the assembly exists on disk. If this reference is required by your code, you may get compilation errors.
18>C:\Windows\Microsoft.NET\Framework\v4.0.30319\Microsoft.Common.targets(1605,5): warning MSB3245: Could not resolve this reference. Could not locate the assembly "System.Reactive.Core". Check to make sure the assembly exists on disk. If this reference is required by your code, you may get compilation errors.
18>C:\Users\Clemens\Projekte\PrismPhotoBrowser\MainViewsModule\Views\MainCategoryView.xaml(36,17): error MC3072: The property 'DoubleClickBehaviour.PreviewMouseDoubleClickCommand' does not exist in XML namespace 'clr-namespace:CustomHelpers;assembly=CustomHelpers'. Line 36 Position 17.
18>C:\Users\Clemens\Projekte\PrismPhotoBrowser\MainViewsModule\Views\MainContentView.xaml(14,17): error MC3072: The property 'MouseGangBehaviour.GangMouse' does not exist in XML namespace 'clr-namespace:CustomHelpers;assembly=CustomHelpers'. Line 14 Position 17.
18>C:\Users\Clemens\Projekte\PrismPhotoBrowser\MainViewsModule\Views\MainMenuView.xaml(9,67): error MC3066: The type reference cannot find a public type named 'DingButton'. Line 9 Position 67.
18>C:\Users\Clemens\Projekte\PrismPhotoBrowser\MainViewsModule\Views\MainStatusBarView.xaml(28,22): error MC3074: The tag 'FileInfoDisplay' does not exist in XML namespace 'clr-namespace:TyburnUserControls;assembly=TyburnUserControls'. Line 28 Position 22.
19>------ Rebuild All started: Project: PrismPhotoBrowser, Configuration: Debug Any CPU ------
19>C:\Users\Clemens\Projekte\PrismPhotoBrowser\PrismPhotoBrowser\Shell.xaml(14,9): error MC3072: The property 'RegionPopupBehaviors.CreatePopupRegionWithName' does not exist in XML namespace 'clr-namespace:Infrastructure.Behaviors;assembly=Infrastructure'. Line 14 Position 9.
========== Rebuild All: 11 succeeded, 8 failed, 0 skipped ==========
Closed Aug 13, 2013 at 6:40 PM by TyburnConsultancy
False report

comments

ClemensF wrote Aug 13, 2013 at 8:07 PM

What's the solution here? Your project can't be built out of the box, as there are missing referenced assemblies.